{"text_format":"1","workbook":"xlsx","n_sheets":12,"sheets":["Instructions","Data","Demographics","ACS Demographics","Population","ACS Population","Race","ACS Race","Income Distribution","Housing Distribution","ACS HIspanic","Definitions"],"not_rendered":{"charts":20,"images":0,"macros":1,"external_links":0,"defined_names":9,"comments":0,"pivot_tables":0},"unopened":[],"bounds":{"document_bytes":16777216,"sheet_cells":100000,"rows_first":2000,"rows_last":500,"rows_between":2000,"halvings":0,"cell_chars":16384,"cell_head_chars":4096},"cells_cut":0,"cells_raw":0,"read":"whole","date_system":"1900"}

{"sheet":"Instructions","index":0,"n_rows":31,"n_cols":16,"rows_kept":31,"cut":false,"hidden":false,"merged":[]}
[]
[null,null,null,null,null,null,null,null,null,null,null,null,null,null,null,"CDX Technologies Support     "]
[null,null,"                         Demographic Report for CDX Bulk Tools",null,null,null,null,null,null,null,null,null,null,null,null,"(973) 895-5542     "]
[null,null,null,null,null,null,null,null,null,null,null,null,null,null,null,"support@CDXTech.com      "]
[]
[]
[null,null,"This template will produce a summary report for the ZIP Code CSV data files created with the following CDX Bulk Demographic Tools."]
[]
[null,null,"Zip Code Demographics Batch Report"]
[null,null,"Zip Code Demographics By Radius Batch Report"]
[null,null,"Zip Code Demographics By State and County Batch Report"]
[]
[null,null,"If you haven't already done so, please enable macros for this Excel file.  Please refer to our website           "]
[null,null," for instructions on how to do this.  You will have to close the file prior to following these instructions."]
[]
[null,null,"Begin by pressing the \"Get Started\" button above.  This will take you to the \"Data\" worksheet where you can import your CSV data. "]
[null,null,"Press the \"Import CSV Data\" button to do this or cut and copy your data into the file making sure to match the correct column headings."]
[null,null,"You can then review the report data on the \"Demographics\", \"Population\", \"Race\"  and other tabs.  A description of each of the "]
[null,null,"demographic factors can be found on the \"Definitions\" tab."]
[]
[null,null,"The data items that total ZIP Code data such as population will only be accurate if your list of ZIP Codes do not contain duplicates. "]
[null,null,"After importing data, if the program finds duplicate ZIP Codes you will be given the option to consolidate and weight results.  The end report "]
[null,null,"will be sorted by ZIP Codes with the highest number of occurences first.  This is useful in analyzing customer lists."]
[]
[null,null,"The report name on the chart worksheets can be changed by updating cell L1 on the \"Data\" tab to reflect the nature of your ZIP Code list."]
[null,null,"Use the File \"Save As\" option to save the updated template under a new name.  This ensures the original template will remain unchanged."]
[]
[null,null,"Note:  This template works with Microsoft Excel 2010 and higher designed to be used for up to 100,000 rows of data.  If you need"]
[null,null,"to analyze more data or require additional customization, please email customsolutions@cdxtech.com or call (877) 239-8321."]
[]
[null,null,"V1.02 Copyright © 2023 Hughes Financial Services, Inc."]

{"sheet":"Data","index":1,"n_rows":6,"n_cols":74,"rows_kept":6,"cut":false,"hidden":false,"merged":[]}
[null,null,null,{"$f":"\"Zip Code Data for \" & L1","v":"Zip Code Data for Example List"},null,null,null,null,null,null,"Report Name","Example List"]
[null,"Your Entry","Distance","City","State","Occurences","Population","Population Estimate","Business Annual Payroll ($1000)","Business First Quarter Payroll ($1000)","Median Age","Male Population","Female Population","Median Age Female","Median Age Male","Households","Persons Per Household","Income Per Household","Number of Businesses","Number of Employees","Delivery Business","Delivery Residential","Delivery Total","Median House Value","CBSA Population","CBSA Division Population","CBSA Name","CBSA Number","CBSA Type","City Alias Name","State Full Name","State FIPS","County Name","County FIPS","Latitude","Longitude","Region","Division","Area Code","DayLight Savings","Land Area","Water Area","Congressional District","Congressional Land Area","Asian Population","Black or African American Population","American Indian or Alaskan Native Population","Native Hawaiian or other Pacific Islander Population","White Population","Other Population","Growing Counties A","Growing Counties B","Growth Increase Number","Growth Increase Percentage","Growth Rank","ACS Age Median","ACS Age Median Female","ACS Age Median Male","ACS Households Total","ACS Household Income Median","ACS Household Size Average","ACS Housing Value Median","ACS Population","ACS Population Female","ACS Population Male","ACS Race Asian","ACS Race Black","ACS Race Hawaiian","ACS Race Indian","ACS Race Other","ACS Race White","ACS Race Two Or More","ACS Race Hispanic","ACS Race Non-Hispanic"]
[null,"90210",null,"BEVERLY HILLS","CA",1,21741,23605,2570383,590989,47.5,10292,11449,47.1,47.9,8669,2.4900000000000002,149732,2466,37602,1439,9480,10814,2000000,0,9818605,"Los Angeles-Long Beach-Anaheim, CA",31080,"Metro","BEVERLY HILLS","California",6,"LOS ANGELES",37,34.103130999999998,-118.416253,"West","Pacific","310/424","Y",10.125999999999999,6.0999999999999999E-2,"28|30|33","218.45|135.94|288.58",1966,471,80,55,19761,387,0,0,0,0,0,49.2,50.8,48.1,7936,147270,2.4300000000000002,2000000,19314,9934,9380,1383,229,0,26,321,16672,683,799,18515]
[null,"90272",null,"PACIFIC PALISADES","CA",1,22986,23216,298837,61908,47.3,10952,12034,47.7,46.8,9212,2.4900000000000002,180962,887,6211,530,9324,10707,2000000,0,9818605,"Los Angeles-Long Beach-Anaheim, CA",31080,"Metro","PACIFIC PALISADES","California",6,"LOS ANGELES",37,34.078344999999999,-118.5475,"West","Pacific",424,"Y",22.832000000000001,0.55000000000000004,33,288.58,1692,288,115,41,21334,265,0,0,0,0,0,47.7,48.6,46.8,8724,192500,2.4700000000000002,2000000,21629,11206,10423,1251,86,6,20,79,18972,1215,1009,20620]
[null,"06830",null,"GREENWICH","CT",1,24027,25162,2872620,993221,42.4,11263,12764,44.1,40.200000000000003,9766,2.4300000000000002,107086,1518,20947,1481,10355,11773,1465100,916829,0,"Bridgeport-Stamford-Norwalk, CT",14860,"Metro","BELLE HAVEN","Connecticut",9,"FAIRFIELD",1,41.039805999999999,-73.625848000000005,"Northeast","New England","203/475","Y",13.538,4.843,4,460.73,1851,1048,107,23,20477,1116,0,0,0,0,0,43,45.2,40.6,9510,119838,2.6,1505200,25036,13170,11866,1716,1348,31,17,968,20058,898,5348,19688]
[null,"78746",null,"AUSTIN","TX",1,26928,29659,3956503,938099,41.1,13319,13609,41.4,40.799999999999997,10839,2.4700000000000002,136138,2525,43551,2372,12008,18772,812900,1716289,0,"Austin-Round Rock-Georgetown, TX",12420,"Metro","AUSTIN","Texas",48,"TRAVIS",453,30.295656999999999,-97.813727,"South","West South Central",512,"Y",22.494,0.91200000000000003,"10|21|25","5070.95|5920.89|7620.7",2079,262,227,38,24477,399,1024272,1063130,38858,3.8,28,42.4,41.8,43.1,10894,151801,2.6,903900,28608,14775,13833,2125,284,0,6,305,25430,458,4048,24560]

{"sheet":"Demographics","index":2,"n_rows":9,"n_cols":11,"rows_kept":9,"cut":false,"hidden":false,"merged":[]}
[{"$f":"\"Demographic Totals and Averages for \" & Data!L1","v":"Demographic Totals and Averages for Example List"}]
[null,"Population",{"$f":"SUM(Data!G3:G100000)","v":95682},"Delivery Business",{"$f":"SUM(Data!U3:U100000)","v":5822}]
[null,"Population Estimate",{"$f":"SUM(Data!H3:H100000)","v":101642},"Delivery Residential",{"$f":"SUM(Data!V3:V100000)","v":41167}]
[null,"Business Annual Payroll ($1000)",{"$f":"SUM(Data!I3:I100000)","v":9698343},"Delivery Total",{"$f":"SUM(Data!W4:W100000)","v":41252}]
[null,"Business First Quarter ($1000)",{"$f":"SUM(Data!J3:J100000)","v":2584217},"Median Housing Value",{"$f":"SUMPRODUCT(Data!$F$3:$F$100000,Data!$X$3:$X$100000*($W$3:$W$100000<>\"0\"))/SUMIF(Data!$X$3:$X$100000,\"<>0\",Data!$F$3:$F$100000)","v":1569500}]
[null,"Median Age",{"$f":"SUMPRODUCT(Data!$F$3:$F$100000,Data!$K$3:$K$100000*($K$3:$K$100000<>\"0\"))/SUMIF(Data!$K$3:$K$100000,\"<>0\",Data!$F$3:$F$100000)","v":44.574999999999996},"Income Per Household",{"$f":"SUMPRODUCT(Data!$F$3:$F$100000,Data!$R$3:$R$100000*($R$3:$R$100000<>\"0\"))/SUMIF(Data!$R$3:$R$100000,\"<>0\",Data!$F$3:$F$100000)","v":143479.5}]
[null,"Median Age Female",{"$f":"SUMPRODUCT(Data!$F$3:$F$100000,Data!$N$3:$N$100000*($N$3:$N$100000<>\"0\"))/SUMIF(Data!$N$3:$N$100000,\"<>0\",Data!$F$3:$F$100000)","v":45.075000000000003},"Number of Businesses",{"$f":"SUM(Data!S3:S1000000)","v":7396},null,null,null,null,null," "]
[null,"Median Age Male",{"$f":"SUMPRODUCT(Data!$F$3:$F$100000,Data!$O$3:$O$100000*($O$3:$O$100000<>\"0\"))/SUMIF(Data!$O$3:$O$100000,\"<>0\",Data!$F$3:$F$100000)","v":43.924999999999997},"Number of Employees",{"$f":"SUM(Data!T3:T100000)","v":108311}]
[null,"Households",{"$f":"SUM(Data!P3:P100000)","v":38486},"Persons Per Household",{"$f":"SUMPRODUCT(Data!$F$3:$F$100000,Data!$Q$3:$Q$100000*($P$3:$P$100000<>\"0\"))/SUMIF(Data!$Q$3:$Q$100000,\"<>0\",Data!$F$3:$F$100000)","v":2.4700000000000002}]

{"sheet":"ACS Demographics","index":3,"n_rows":7,"n_cols":11,"rows_kept":7,"cut":false,"hidden":false,"merged":[]}
[{"$f":"\"ACS Demographic Totals and Averages for \" & Data!L1","v":"ACS Demographic Totals and Averages for Example List"}]
[null,"Population",{"$f":"SUM(Data!BK3:BK100000)","v":94587},"Households",{"$f":"SUM(Data!P3:P100000)","v":38486}]
[null,"Median Age",{"$f":"SUMPRODUCT(Data!$F$3:$F$100000,Data!$BD$3:$BD$100000*($BD$3:$BD$100000<>\"0\"))/SUMIF(Data!$BD$3:$BD$100000,\"<>0\",Data!$F$3:$F$100000)","v":45.575000000000003},"Persons Per Household",{"$f":"SUMPRODUCT(Data!$F$3:$F$100000,Data!$BI$3:$BI$100000*($BI$3:$BI$100000<>\"0\"))/SUMIF(Data!$BI$3:$BI$100000,\"<>0\",Data!$F$3:$F$100000)","v":2.5249999999999999}]
[null,"Median Age Female",{"$f":"SUMPRODUCT(Data!$F$3:$F$100000,Data!$BE$3:$BE$100000*($BE$3:$BE$100000<>\"0\"))/SUMIF(Data!$BE$3:$BE$100000,\"<>0\",Data!$F$3:$F$100000)","v":46.600000000000009},"Income Per Household",{"$f":"SUMPRODUCT(Data!$F$3:$F$100000,Data!$BH$3:$BH$100000*($BH$3:$BH$100000<>\"0\"))/SUMIF(Data!$BH$3:$BH$100000,\"<>0\",Data!$F$3:$F$100000)","v":152852.25}]
[null,"Median Age Male",{"$f":"SUMPRODUCT(Data!$F$3:$F$100000,Data!$BF$3:$BF$100000*($BF$3:$BF$100000<>\"0\"))/SUMIF(Data!$BF$3:$BF$100000,\"<>0\",Data!$F$3:$F$100000)","v":44.65},"Median Housing Value",{"$f":"SUMPRODUCT(Data!$F$3:$F$100000,Data!$BJ$3:$BJ$100000*($BJ$3:$BJ$100000<>\"0\"))/SUMIF(Data!$BJ$3:$BJ$100000,\"<>0\",Data!$F$3:$F$100000)","v":1602275}]
[]
[null,null,null,null,null,null,null,null,null,null," "]

{"sheet":"Population","index":4,"n_rows":5,"n_cols":7,"rows_kept":5,"cut":false,"hidden":false,"merged":[]}
[{"$f":"\"Gender Information for \" & Data!L1","v":"Gender Information for Example List"}]
[null,null,null,null,null,"Number","Percent"]
[null,null,null,null,"Male",{"$f":"SUM(Data!L3:L100000)","v":45826},{"$f":"F3/(F$5+0.000001)","v":0.47894065758994442}]
[null,null,null,null,"Female",{"$f":"SUM(Data!M3:M100000)","v":49856},{"$f":"F4/(F$5+0.000001)","v":0.52105934239960439}]
[null,null,null,null,"Total Population",{"$f":"SUM(F3,F4)","v":95682},1]

{"sheet":"ACS Population","index":5,"n_rows":5,"n_cols":7,"rows_kept":5,"cut":false,"hidden":false,"merged":[]}
[{"$f":"\"ACS Gender Information for \" & Data!L1","v":"ACS Gender Information for Example List"}]
[null,null,null,null,null,"Number","Percent"]
[null,null,null,null,"Male",{"$f":"SUM(Data!BM3:BM100000)","v":45502},{"$f":"F3/(F$5+0.000001)","v":0.48105976507891091}]
[null,null,null,null,"Female",{"$f":"SUM(Data!BL3:BL100000)","v":49085},{"$f":"F4/(F$5+0.000001)","v":0.51894023491051688}]
[null,null,null,null,"Total Population",{"$f":"SUM(F3,F4)","v":94587},1]

{"sheet":"Race","index":6,"n_rows":9,"n_cols":5,"rows_kept":9,"cut":false,"hidden":false,"merged":[]}
[{"$f":"\"Race Information for \"& Data!L1","v":"Race Information for Example List"}]
[null,null,null,"Number","Percent"]
[null,null,"Asian",{"$f":"SUM(Data!AS$3:AS$100000)","v":7588},{"$f":"D3/($D$9+0.000000001)","v":7.6989417506264493E-2}]
[null,null,"Black or African American",{"$f":"SUM(Data!AT$3:AT$100000)","v":2069},{"$f":"D4/($D$9+0.000000001)","v":2.0992501953144602E-2}]
[null,null,"American Indian or Alaskan Native",{"$f":"SUM(Data!AU$3:AU$100000)","v":529},5.3673434186628779E-3]
[null,null,"Native Hawaiian or other Pacific Islander",{"$f":"SUM(Data!AV$3:AV$100000)","v":157},1.5929544739698902E-3]
[null,null,"White",{"$f":"SUM(Data!AW$3:AW$100000)","v":86049},0.87307095242442723]
[null,null,"Other",{"$f":"SUM(Data!AX$3:AX$100000)","v":2167},2.1986830223520711E-2]
[null,null,"Total Population",{"$f":"SUM(D3:D8)","v":98559},0.99999999999998979]

{"sheet":"ACS Race","index":7,"n_rows":10,"n_cols":5,"rows_kept":10,"cut":false,"hidden":false,"merged":[]}
[{"$f":"\"ACS Race Information for \"& Data!L1","v":"ACS Race Information for Example List"}]
[null,null,null,"Number","Percent"]
[null,null,"Asian",{"$f":"SUM(Data!BN$3:BN$100000)","v":6475},{"$f":"D3/($D$10+0.000000001)","v":6.8455495998392291E-2}]
[null,null,"Black or African American",{"$f":"SUM(Data!BO$3:BO$100000)","v":1947},{"$f":"D4/($D$10+0.000000001)","v":2.0584224047701896E-2}]
[null,null,"American Indian or Alaskan Native",{"$f":"SUM(Data!BQ$3:BQ$100000)","v":69},7.2948713882456644E-4]
[null,null,"Native Hawaiian or other Pacific Islander",{"$f":"SUM(Data!BP$3:BP$100000)","v":37},3.911742628479559E-4]
[null,null,"White",{"$f":"SUM(Data!BS$3:BS$100000)","v":81132},0.85775000792919898]
[null,null,"Two or More Races",{"$f":"SUM(Data!BT$3:BT$100000)","v":3254},{"$f":"D8/($D$10+0.000000001)","v":3.4402190575871586E-2}]
[null,null,"Other",{"$f":"SUM(Data!BR$3:BR$100000)","v":1673},1.768742004715217E-2]
[null,null,"Total Population",{"$f":"SUM(D3:D9)","v":94587},0.99999999999998934]

{"sheet":"Income Distribution","index":8,"n_rows":11,"n_cols":5,"rows_kept":11,"cut":false,"hidden":false,"merged":[]}
[{"$f":"\"Household Income Distribution for \"& Data!L1","v":"Household Income Distribution for Example List"}]
[null,null,null,"Number","Percent"]
[null,null,"0-25K*",{"$f":"SUMIFS(Data!$F$3:$F$100000,Data!$R$3:$R$100000,\"<=25000\")+SUMIFS(Data!$F$3:$F$100000,Data!$R$3:$R$100000,\"\")","v":0},{"$f":"D3/($D$9+0.000000001)","v":0}]
[null,null,">25K to 50K",{"$f":"SUMIFS(Data!$F$3:$F$100000,Data!$R$3:$R$100000,\"<=50000\",Data!$R$3:$R$100000,\">25000\")","v":0},{"$f":"D4/($D$9+0.000000001)","v":0}]
[null,null,"50K to 75K",{"$f":"SUMIFS(Data!$F$3:$F$100000,Data!$R$3:$R$100000,\"<=75000\",Data!$R$3:$R$100000,\">50000\")","v":0},0]
[null,null,"75K-100K",{"$f":"SUMIFS(Data!$F$3:$F$100000,Data!$R$3:$R$100000,\"<=100000\",Data!$R$3:$R$100000,\">75000\")","v":0},0]
[null,null,"100K - 125K",{"$f":"SUMIFS(Data!$F$3:$F$100000,Data!$R$3:$R$100000,\"<=125000\",Data!$R$3:$R$100000,\">100000\")","v":1},0.24999999993749999]
[null,null,">125K",{"$f":"SUMIFS(Data!$F$3:$F$100000,Data!$R$3:$R$100000,\">125000\")","v":3},0.74999999981249998]
[null,null,"Total Zip Codes",{"$f":"SUM(D3:D8)","v":4},0.99999999974999998]
[null,null,"Total Unique Zip Codes",{"$f":"COUNTA(Data!B3:B100000)","v":4}]
[null,null,"*May include zip codes with no data"]

{"sheet":"Housing Distribution","index":9,"n_rows":11,"n_cols":5,"rows_kept":11,"cut":false,"hidden":false,"merged":[]}
[{"$f":"\"House Value Distribution for \"& Data!L1","v":"House Value Distribution for Example List"}]
[null,null,null,"Number","Percent"]
[null,null,"0-100K*",{"$f":"SUMIFS(Data!$F$3:$F$100000,Data!$X$3:$X$100000,\"<=100000\")+SUMIFS(Data!$F$3:$F$100000,Data!$X$3:$X$100000,\"\")","v":0},{"$f":"D3/($D$9+0.000000001)","v":0}]
[null,null,">100K to 150K",{"$f":"SUMIFS(Data!$F$3:$F$100000,Data!$X$3:$X$100000,\"<=150000\",Data!$X$3:$X$100000,\">100000\")","v":0},{"$f":"D4/($D$9+0.000000001)","v":0}]
[null,null,">150K to 250K",{"$f":"SUMIFS(Data!$F$3:$F$100000,Data!$X$3:$X$100000,\"<=250000\",Data!$X$3:$X$100000,\">150000\")","v":0},0]
[null,null,">250K-500K",{"$f":"SUMIFS(Data!$F$3:$F$100000,Data!$X$3:$X$100000,\"<=500000\",Data!$X$3:$X$100000,\">250000\")","v":0},0]
[null,null,">500K - 750K",{"$f":"SUMIFS(Data!$F$3:$F$100000,Data!$X$3:$X$100000,\"<=750000\",Data!$X$3:$X$100000,\">500000\")","v":0},0]
[null,null,">750K",{"$f":"SUMIFS(Data!$F$3:$F$100000,Data!$X$3:$X$100000,\">750000\")","v":4},0.99999999974999998]
[null,null,"Total Zip Codes",{"$f":"SUM(D3:D8)","v":4},0.99999999974999998]
[null,null,"Total Unique Zip Codes",{"$f":"COUNTA(Data!B3:B100000)","v":4}]
[null,null,"*May include zip codes with no data"]

{"sheet":"ACS HIspanic","index":10,"n_rows":5,"n_cols":5,"rows_kept":5,"cut":false,"hidden":false,"merged":[]}
[{"$f":"\"ACS Hispanic Information for \"& Data!L1","v":"ACS Hispanic Information for Example List"}]
[null,null,null,"Number","Percent"]
[null,null,"Hispanic",{"$f":"SUM(Data!BU$3:BU$100000)","v":11204},{"$f":"D3/($D$5+0.000000001)","v":0.11845179570131076}]
[null,null,"Non-Hispanic",{"$f":"SUM(Data!BV$3:BV$100000)","v":83383},{"$f":"D4/($D$5+0.000000001)","v":0.88154820429867864}]
[null,null,"Total Population",{"$f":"SUM(D3:D4)","v":94587},{"$f":"D5/($D$5+0.000000001)","v":0.99999999999998934}]

{"sheet":"Definitions","index":11,"n_rows":90,"n_cols":2,"rows_kept":90,"cut":false,"hidden":false,"merged":[]}
[null,"Definitions"]
[null,"Population - The population of the Zip Code from the Year 2020 U.S. Census.  The total on the \"Demographics\" page is the total for all zip codes on the \"Data\" sheet."]
[]
[null,"ACS Population - The population of the Zip Code from the latest U.S. Census American Community Survey.  The total on the \"Demographics\" page is the total for all zip codes on the \"Data\" sheet."]
[]
[null,"Population Estimate - The current estimated household population of the Zip Code.  The total on the \"Demographics\" page is the total for all zip codes on the \"Data\" sheet."]
[]
[null,"Business Annual Payroll - The total annual payroll for this ZIP Code from the U.S. Business Census.  The total on the \"Demographics\" page is the total for all zip codes on the \"Data\" sheet."]
[]
[null,"Business First Quarter Payroll - The first quarter payroll for this ZIP Code from the U.S. Business Census.  The total on the \"Demographics\" page is the total for all zip codes on the \"Data\" sheet."]
[]
[null,"Median Age - The Median Age in the Zip Code the Year 2020 U.S. Census.   The age on the \"Demographics\"sheet is the weighted average of all non-zero zip codes on the \"Data\" sheet."]
[]
[null,"ACS Median Age - The Median Age in the Zip Code the latest U.S. Census American Community Survey.   The age on the \"Demographics\"sheet is the weighted average of all non-zero zip codes on the \"Data\" sheet."]
[]
[null,"Median Age Female - The Female Median Age in the Zip Code from the Year 2020 U.S. Census.  The age on the \"Demographics\"sheet is the weighted average of all non-zero zip codes on the \"Data\" sheet."]
[]
[null,"ACS Median Age Female - The Female Median Age in the Zip Code from the latest U.S. Census American Community Survey.  The age on the \"Demographics\"sheet is the weighted average of all non-zero zip codes on the \"Data\" sheet."]
[]
[null,"Median Age Male - The Male Median Age in the Zip Code the Year 2020 U.S. Census.  The age on the \"Demographics\"sheet is the weighted average of all all non-zero zip codes on the \"Data\" sheet."]
[]
[null,"ACS Median Age Male - The Male Median Age in the Zip Code from the latest U.S. Census American Community Survey.  The age on the \"Demographics\"sheet is the weighted average of all non-zero zip codes on the \"Data\" sheet."]
[]
[null,"Persons Per Household - The Persons per Household in the Zip Code from the Year 2020 U.S. Census.  The number on the \"Demographics\"sheet is the weighted average of all all non-zero zip codes on the \"Data\" sheet."]
[]
[null,"ACS Household Size Average - The Persons per Household in the Zip Code from the latest U.S. Census American Community Survey.  The number on the \"Demographics\"sheet is the weighted average of all all non-zero zip codes on the \"Data\" sheet."]
[]
[null,"IncomePerHousehold - The Income per Household in the Zip Code from the Year 2020 U.S. Census.  The income on the \"Demographics\"sheet is the weighted average of all all non-zero zip codes on the \"Data\" sheet."]
[]
[null,"ACS Household Income Median- The Income per Household in the Zip Code from the latest U.S. Census American Community Survey.  The income on the \"Demographics\"sheet is the weighted average of all all non-zero zip codes on the \"Data\" sheet."]
[]
[null,"Number of Businesses - The total number of Business Establishments for this zip Code from the U.S. Business Census.  The total on the \"Demographics\" page is the total for all zip codes on the \"Data\" sheet."]
[]
[null,"Number of Employees - The total number of employees for this ZIP Code from the U.S. Business Census.  The total on the \"Demographics\" page is the total for all zip codes on the \"Data\" sheet."]
[]
[null,"Delivery Business - This field provides the number of active business delivery mailboxes and centralized units for this ZIP Code.  The total on the \"Demographics\" page is the total for all zip codes on the \"Data\" sheet."]
[]
[null,"Delivery Residential - This field provides the number of active residential delivery mailboxes and centralized units for this ZIP Code.  The total on the \"Demographics\" page is the total for all zip codes on the \"Data\" sheet."]
[]
[null,"Delivery Total - This field provides the total number of active delivery mailboxes and centralized units for this ZIP Code.  The total on the \"Demographics\" page is the total for all zip codes on the \"Data\" sheet."]
[]
[null,"Average House Value - The Average House Value in the Zip Code from the Year 2010 U.S. Census.   The value on the \"Demographics\"sheet is the weighted average of all zip codes on the \"Data\" sheet."]
[]
[null,"Growing Counties A - The estimated number of housing units in this county as of July 1, 2010. Source: Population Division, U.S. Census. Bureau."]
[]
[null,"Growing Counties B - The estimated number of housing units in this county as of. July 1, 2011. Source: Population Division, U.S. Census. Bureau"]
[]
[null,"Growth Increase Number - The change in housing units from 2003 to 2004, expressed as a number according to the US Census."]
[]
[null,"Growth Increase Percentage - The change in housing units from 2010 to 2011, expressed as a percentage according to the US Census."]
[]
[null,"Growth Rank - The growth rank for this county according to the US Census."]
[]
[null,"CBSA Population - The estimated population for the selected CBSA in 2010."]
[]
[null,"CBSA Division Population - The estimated population for the selected CBSA Division in 2010."]
[]
[null,"CBSA Division - Core Based Statistical Area Division name"]
[]
[null,"Male Population - The Male population in the Zip Code from the Year 2020 U.S. Census. The total on the \"Demographics\" page is the total for all zip codes on the \"Data\" sheet."]
[]
[null,"ACS Male Population - The Male population in the Zip Code from the latest U.S. Census American Community Survey. The total on the \"Demographics\" page is the total for all zip codes on the \"Data\" sheet."]
[]
[null,"Female Population The Female population in the Zip Code from the Year 2020 U.S. Census. The total on the \"Demographics\" page is the total for all zip codes on the \"Data\" sheet."]
[]
[null,"ACS Female Population The Female population in the Zip Code from the latest U.S. Census American Community Survey. The total on the \"Demographics\" page is the total for all zip codes on the \"Data\" sheet."]
[]
[null,"Asian Population - The Asian population in the Zip Code from the Year 2020 U.S. Census. The total on the \"Race\" page is the total for all zip codes on the \"Data\" sheet."]
[]
[null,"ACS Asian Population - The Asian population in the Zip Code from the latest U.S. Census American Community Survey. The total on the \"Race\" page is the total for all zip codes on the \"Data\" sheet."]
[]
[null,"Black Population - The Black population in the Zip Code from the Year 2020 U.S. Census.  The total on the \"Race\" page is the total for all zip codes on the \"Data\" sheet."]
[]
[null,"ACS Black Population - The Black population in the Zip Code from the latest U.S. Census American Community Survey.  The total on the \"Race\" page is the total for all zip codes on the \"Data\" sheet."]
[]
[null,"Indian Population - The Indian population in the Zip Code from the Year 2020 U.S. Census.  The total on the \"Race\" page is the total for all zip codes on the \"Data\" sheet."]
[]
[null,"ACS Indian Population - The Indian population in the Zip Code from  the latest U.S. Census American Community Survey.  The total on the \"Race\" page is the total for all zip codes on the \"Data\" sheet."]
[]
[null,"Hawaiian Population - The Hawaiian population in the Zip Code from the Year 2020 U.S. Census.  The total on the \"Race\" page is the total for all zip codes on the \"Data\" sheet."]
{"$rows_left_out":10}